{"text_format":"1","workbook":"xlsx","n_sheets":8,"sheets":["Frontpage ","Company_Profile","Quality","Questions_QMS","Questions_H_S","Questions_GCP","Vocabularies","Formeln"],"not_rendered":{"charts":5,"images":2,"macros":1,"external_links":0,"defined_names":32,"comments":0,"pivot_tables":0},"unopened":[],"bounds":{"document_bytes":16777216,"sheet_cells":100000,"rows_first":2000,"rows_last":500,"rows_between":2000,"halvings":0,"cell_chars":16384,"cell_head_chars":4096},"cells_cut":0,"cells_raw":0,"read":"whole","date_system":"1900"}

{"sheet":"Frontpage ","index":0,"n_rows":5,"n_cols":14,"rows_kept":5,"cut":false,"hidden":false,"merged":[[4,2,4,12]]}
[null,null,null,null,null,null,null,null,null,null,null,null,null,"Sprache / Language ==>"]
[]
[]
[]
[null,null,{"$f":"VLOOKUP(Vocabularies!B7,Vocabularies!$B$1:$G$358,Vocabularies!$J$2,0)","v":"Supplier Self-Assessment"}]

{"sheet":"Company_Profile","index":1,"n_rows":106,"n_cols":23,"rows_kept":106,"cut":false,"hidden":false,"merged":[[68,0,68,1],[69,0,69,1],[70,0,70,1],[71,0,71,1],[72,0,72,1],[68,2,68,4],[68,5,68,9],[69,2,69,4],[70,2,70,4],[71,2,71,4],[72,2,72,4],[69,5,69,9],[70,5,70,9],[71,5,71,9],[72,5,72,9],[40,1,40,5],[39,6,39,11],[39,12,39,16],[39,17,39,24],[40,6,40,11],[40,12,40,16],[40,17,40,24],[3,22,3,24],[34,1,34,5],[35,1,35,5],[36,1,36,5],[38,1,38,5],[39,1,39,5],[35,17,35,24],[36,6,36,11],[22,1,22,10],[22,12,22,24],[6,12,6,24],[7,12,7,24],[9,12,9,24],[10,1,10,10],[10,12,10,24],[12,12,12,24],[36,17,36,24],[26,6,26,24],[16,1,16,10],[16,12,16,24],[18,12,18,24],[1,0,1,13],[49,11,49,12],[2,0,2,13],[33,12,33,16],[34,6,34,11],[34,12,34,16],[35,6,35,11],[35,12,35,16],[49,16,49,17],[13,12,13,24],[3,18,3,20],[49,14,49,15],[27,6,27,24],[28,6,28,24],[33,17,33,24],[34,17,34,24],[7,1,7,10],[33,1,33,5],[33,6,33,11],[13,1,13,10],[38,17,38,24],[19,1,19,10],[19,12,19,24],[15,12,15,24],[21,12,21,24],[70,11,70,13],[70,14,70,16],[70,17,70,21],[70,22,70,24],[71,11,71,13],[71,14,71,16],[71,17,71,21],[71,22,71,24],[68,22,68,24],[69,11,69,13],[69,14,69,16],[69,17,69,21],[69,22,69,24],[68,11,68,13],[36,12,36,16],[68,14,68,16],[68,17,68,21],[38,6,38,11],[38,12,38,16],[72,11,72,13],[72,14,72,16],[89,11,89,18],[88,5,88,9],[88,0,88,2],[87,11,87,18],[72,17,72,21],[72,22,72,24],[85,3,85,4],[86,3,86,4],[85,11,85,18],[86,11,86,18],[86,19,86,21],[85,22,85,24],[86,22,86,24],[108,20,108,24],[105,20,105,24],[106,20,106,24],[108,13,108,19],[107,0,107,6],[108,0,108,6],[94,15,94,24],[92,6,92,8],[93,6,93,8],[94,6,94,8],[101,0,101,5],[102,0,102,5],[101,6,101,10],[101,11,101,14],[101,15,101,19],[101,20,101,24],[100,20,100,24],[100,6,100,10],[94,9,94,14],[100,0,100,5],[99,0,99,5],[99,6,99,10],[108,7,108,12],[106,13,106,19],[107,13,107,19],[105,13,105,19],[106,7,106,12],[107,7,107,12],[102,6,102,10],[102,11,102,14],[102,15,102,19],[37,17,37,24],[93,9,93,14],[92,9,92,14],[92,15,92,24],[93,15,93,24],[37,1,37,5],[37,6,37,11],[37,12,37,16],[105,7,105,12],[102,20,102,24],[87,22,87,24],[88,22,88,24],[89,22,89,24],[85,19,85,21],[87,19,87,21],[88,19,88,21],[89,19,89,21],[85,0,85,2],[86,0,86,2],[87,0,87,2],[85,5,85,9],[86,5,86,9],[87,3,87,4],[87,5,87,9],[88,11,88,18],[107,20,107,24],[99,15,99,19],[99,20,99,24],[100,15,100,19],[92,0,92,5],[93,0,93,5],[99,11,99,14],[100,11,100,14],[94,0,94,5],[105,0,105,6],[106,0,106,6],[88,3,88,4],[89,0,89,2],[89,3,89,4],[89,5,89,9]]}
[null,null,null,null,null,null,null,null,null,null,null,null,null,null,"Sprache / Language ==>"]
[{"$f":"VLOOKUP(Vocabularies!B7,Vocabularies!$B$1:$G$358,Vocabularies!$J$2,0)","v":"Supplier Self-Assessment"},{"$f":"VLOOKUP(\"Reason:\",Vocabularies!#REF!,Vocabularies!#REF!,0)","v":{"$error":"#REF!"}},{"$f":"VLOOKUP(\"Reason:\",Vocabularies!#REF!,Vocabularies!#REF!,0)","v":{"$error":"#REF!"}},{"$f":"VLOOKUP(\"Reason:\",Vocabularies!#REF!,Vocabularies!#REF!,0)","v":{"$error":"#REF!"}},{"$f":"VLOOKUP(\"Reason:\",Vocabularies!#REF!,Vocabularies!#REF!,0)","v":{"$error":"#REF!"}},{"$f":"VLOOKUP(\"Reason:\",Vocabularies!#REF!,Vocabularies!#REF!,0)","v":{"$error":"#REF!"}},{"$f":"VLOOKUP(\"Reason:\",Vocabularies!#REF!,Vocabularies!#REF!,0)","v":{"$error":"#REF!"}},{"$f":"VLOOKUP(\"Reason:\",Vocabularies!#REF!,Vocabularies!#REF!,0)","v":{"$error":"#REF!"}},{"$f":"VLOOKUP(\"Reason:\",Vocabularies!#REF!,Vocabularies!#REF!,0)","v":{"$error":"#REF!"}},{"$f":"VLOOKUP(\"Reason:\",Vocabularies!#REF!,Vocabularies!#REF!,0)","v":{"$error":"#REF!"}},{"$f":"VLOOKUP(\"Reason:\",Vocabularies!#REF!,Vocabularies!#REF!,0)","v":{"$error":"#REF!"}},{"$f":"VLOOKUP(\"Reason:\",Vocabularies!#REF!,Vocabularies!#REF!,0)","v":{"$error":"#REF!"}},{"$f":"VLOOKUP(\"Reason:\",Vocabularies!#REF!,Vocabularies!#REF!,0)","v":{"$error":"#REF!"}},{"$f":"VLOOKUP(\"Reason:\",Vocabularies!#REF!,Vocabularies!#REF!,0)","v":{"$error":"#REF!"}}]
[]
["Status: Rev 05",null,null,null,null,null,null,null,null,null,null,null,null,null,null,null,null,null,{"$f":"VLOOKUP(Vocabularies!B3,Vocabularies!B1:G358,Vocabularies!J2,0)","v":"Date:"}]
[{"$f":"VLOOKUP(Vocabularies!B6,Vocabularies!$B$1:$G$358,Vocabularies!$J$2,0)","v":"Section A, Company Profil"}]
[]
[null,{"$f":"VLOOKUP(Vocabularies!B8,Vocabularies!$B$1:$G$358,Vocabularies!$J$2,0)","v":"Company name (including legal form):"},null,null,null,null,null,null,null,null,null,null,{"$f":"VLOOKUP(Vocabularies!B9,Vocabularies!$B$1:$G$358,Vocabularies!$J$2,0)","v":"Form completed by: "}]
[]
[]
[null,{"$f":"VLOOKUP(Vocabularies!B10,Vocabularies!$B$1:$G$358,Vocabularies!$J$2,0)","v":"Facility Address:"},null,null,null,null,null,null,null,null,null,null,{"$f":"VLOOKUP(Vocabularies!B11,Vocabularies!$B$1:$G$358,Vocabularies!$J$2,0)","v":"Department:"}]
{"$rows_left_out":97}
{"sheet":"Quality","index":2,"n_rows":41,"n_cols":23,"rows_kept":41,"cut":false,"hidden":false,"merged":[[39,18,39,24],[40,1,40,8],[33,9,33,11],[33,12,33,14],[35,9,35,11],[34,1,34,8],[35,1,35,8],[36,1,36,8],[37,1,37,8],[37,18,37,24],[38,9,38,11],[38,18,38,24],[38,1,38,8],[40,9,40,11],[40,12,40,14],[40,15,40,17],[40,18,40,24],[39,9,39,11],[39,12,39,14],[38,12,38,14],[34,9,34,11],[34,12,34,14],[34,15,34,17],[39,1,39,8],[38,15,38,17],[37,9,37,11],[37,12,37,14],[37,15,37,17],[39,15,39,17],[18,1,18,12],[19,1,19,12],[9,1,9,5],[10,1,10,5],[11,1,11,5],[12,1,12,5],[12,9,12,12],[17,1,17,12],[36,9,36,11],[1,0,1,13],[2,0,2,13],[3,18,3,20],[11,6,11,8],[12,6,12,8],[10,9,10,12],[11,9,11,12],[13,13,13,19],[13,20,13,24],[13,6,13,8],[13,9,13,12],[13,1,13,5],[9,20,9,24],[10,20,10,24],[10,6,10,8],[25,13,25,19],[25,20,25,24],[3,22,3,24],[9,6,9,8],[9,9,9,12],[9,13,9,19],[23,13,23,19],[23,20,23,24],[24,13,24,19],[24,20,24,24],[10,13,10,19],[11,13,11,19],[12,13,12,19],[14,6,14,8],[14,9,14,12],[14,13,14,19],[14,20,14,24],[20,1,20,12],[21,1,21,12],[22,1,22,12],[23,1,23,12],[11,20,11,24],[12,20,12,24],[32,1,32,8],[33,1,33,8],[33,18,33,24],[32,9,32,11],[32,12,32,14],[32,15,32,17],[33,15,33,17],[32,18,32,24],[26,20,26,24],[24,1,24,12],[25,1,25,12],[28,1,28,12],[29,1,29,12],[26,1,26,12],[27,1,27,12],[27,20,27,24],[28,13,28,19],[28,20,28,24],[29,13,29,19],[29,20,29,24],[26,13,26,19],[14,1,14,5],[17,13,17,19],[17,20,17,24],[18,13,18,19],[18,20,18,24],[21,13,21,19],[21,20,21,24],[22,13,22,19],[22,20,22,24],[27,13,27,19],[36,12,36,14],[36,15,36,17],[36,18,36,24],[19,13,19,19],[19,20,19,24],[20,13,20,19],[20,20,20,24],[34,18,34,24],[35,12,35,14],[35,15,35,17],[35,18,35,24]]}
[]
[{"$f":"VLOOKUP(Vocabularies!B7,Vocabularies!$B$1:$G$358,Vocabularies!$J$2,0)","v":"Supplier Self-Assessment"},{"$f":"VLOOKUP(\"Reason:\",Vocabularies!#REF!,Vocabularies!#REF!,0)","v":{"$error":"#REF!"}},{"$f":"VLOOKUP(\"Reason:\",Vocabularies!#REF!,Vocabularies!#REF!,0)","v":{"$error":"#REF!"}},{"$f":"VLOOKUP(\"Reason:\",Vocabularies!#REF!,Vocabularies!#REF!,0)","v":{"$error":"#REF!"}},{"$f":"VLOOKUP(\"Reason:\",Vocabularies!#REF!,Vocabularies!#REF!,0)","v":{"$error":"#REF!"}},{"$f":"VLOOKUP(\"Reason:\",Vocabularies!#REF!,Vocabularies!#REF!,0)","v":{"$error":"#REF!"}},{"$f":"VLOOKUP(\"Reason:\",Vocabularies!#REF!,Vocabularies!#REF!,0)","v":{"$error":"#REF!"}},{"$f":"VLOOKUP(\"Reason:\",Vocabularies!#REF!,Vocabularies!#REF!,0)","v":{"$error":"#REF!"}},{"$f":"VLOOKUP(\"Reason:\",Vocabularies!#REF!,Vocabularies!#REF!,0)","v":{"$error":"#REF!"}},{"$f":"VLOOKUP(\"Reason:\",Vocabularies!#REF!,Vocabularies!#REF!,0)","v":{"$error":"#REF!"}},{"$f":"VLOOKUP(\"Reason:\",Vocabularies!#REF!,Vocabularies!#REF!,0)","v":{"$error":"#REF!"}},{"$f":"VLOOKUP(\"Reason:\",Vocabularies!#REF!,Vocabularies!#REF!,0)","v":{"$error":"#REF!"}},{"$f":"VLOOKUP(\"Reason:\",Vocabularies!#REF!,Vocabularies!#REF!,0)","v":{"$error":"#REF!"}},{"$f":"VLOOKUP(\"Reason:\",Vocabularies!#REF!,Vocabularies!#REF!,0)","v":{"$error":"#REF!"}}]
[]
["Status: Rev 01",null,null,null,null,null,null,null,null,null,null,null,null,null,null,null,null,null,{"$f":"VLOOKUP(Vocabularies!B3,Vocabularies!B1:G358,Vocabularies!J2,0)","v":"Date:"},null,null,null,{"$f":"Company_Profile!$W$4","v":"00:00:00"}]
[{"$f":"VLOOKUP(Vocabularies!B77,Vocabularies!$B$1:$G$358,Vocabularies!$J$2,0)","v":"Section C, Quality"}]
[{"$f":"VLOOKUP(Vocabularies!B78,Vocabularies!$B$1:$I$358,Vocabularies!$J$2,0)","v":"Quality and Environmental Management and Safty Certification"}]
[{"$f":"VLOOKUP(Vocabularies!B79,Vocabularies!$B$1:$I$358,Vocabularies!$J$2,0)","v":"Please mark with a cross and enclose a copy of the facility certificates."}]
[]
[]
[null,{"$f":"VLOOKUP(Vocabularies!B80,Vocabularies!$B$1:$G$358,Vocabularies!$J$2,0)","v":"Certificate"},null,null,null,null,{"$f":"VLOOKUP(Vocabularies!B58,Vocabularies!$B$1:$G$358,Vocabularies!$J$2,0)","v":"Current"},null,null,{"$f":"VLOOKUP(Vocabularies!B59,Vocabularies!$B$1:$I$358,Vocabularies!$J$2,0)","v":"If no, planned at?"},null,null,null,{"$f":"VLOOKUP(Vocabularies!B87,Vocabularies!$B$1:$G$358,Vocabularies!$J$2,0)","v":"Certification / expiry dates"},null,null,null,null,null,null,{"$f":"VLOOKUP(Vocabularies!B88,Vocabularies!$B$1:$G$358,Vocabularies!$J$2,0)","v":"Certification-Organization"}]
{"$rows_left_out":32}
{"sheet":"Questions_QMS","index":3,"n_rows":260,"n_cols":23,"rows_kept":260,"cut":false,"hidden":false,"merged":[[174,17,174,19],[190,17,190,19],[248,7,248,16],[194,7,196,16],[238,7,240,16],[241,7,243,16],[6,17,6,19],[6,7,6,16],[25,7,25,16],[32,7,32,16],[7,7,9,16],[190,7,190,16],[209,7,209,16],[191,7,193,16],[184,7,186,16],[187,7,189,16],[209,17,209,19],[200,7,202,16],[206,7,208,16],[231,17,231,19],[244,17,244,19],[248,17,248,19],[65,17,65,19],[78,17,78,19],[91,17,91,19],[128,17,128,19],[162,7,164,16],[165,7,167,16],[169,2,169,6],[172,2,172,6],[168,7,170,16],[171,7,173,16],[22,7,24,16],[25,17,25,19],[32,17,32,19],[48,17,48,19],[61,17,61,19],[163,2,163,6],[151,2,151,6],[154,2,154,6],[150,7,152,16],[153,7,155,16],[156,7,158,16],[159,7,161,16],[139,2,139,6],[142,2,142,6],[138,7,140,16],[141,7,143,16],[145,2,145,6],[148,2,148,6],[135,7,137,16],[92,7,94,16],[110,7,112,16],[107,7,109,16],[144,7,146,16],[147,7,149,16],[120,2,120,6],[123,2,123,6],[130,2,130,6],[133,2,133,6],[136,2,136,6],[179,2,179,6],[176,2,176,6],[80,2,80,6],[117,2,117,6],[105,2,105,6],[108,2,108,6],[157,2,157,6],[160,2,160,6],[166,2,166,6],[126,2,126,6],[0,8,0,10],[83,2,83,6],[40,2,40,6],[23,2,23,6],[48,7,48,16],[61,7,61,16],[26,7,28,16],[55,7,57,16],[0,0,0,2],[46,2,46,6],[37,2,37,6],[76,2,76,6],[0,3,0,5],[3,3,5,3],[2,4,2,5],[43,2,43,6],[50,2,50,6],[8,2,8,6],[11,2,11,6],[27,2,27,6],[20,2,20,6],[36,7,38,16],[39,7,41,16],[42,7,44,16],[34,2,34,6],[192,2,192,6],[53,2,53,6],[67,2,67,6],[78,7,78,16],[113,7,115,16],[91,7,91,16],[66,7,68,16],[69,7,71,16],[72,7,74,16],[75,7,77,16],[82,7,84,16],[85,7,87,16],[88,7,90,16],[185,2,185,6],[96,2,96,6],[99,2,99,6],[102,2,102,6],[93,2,93,6],[89,2,89,6],[86,2,86,6],[214,2,214,6],[210,7,212,16],[213,7,215,16],[14,2,14,6],[17,2,17,6],[30,2,30,6],[204,2,204,6],[207,2,207,6],[203,7,205,16],[198,2,198,6],[201,2,201,6],[197,7,199,16],[195,2,195,6],[56,2,56,6],[59,2,59,6],[114,2,114,6],[73,2,73,6],[111,2,111,6],[62,7,64,16],[63,2,63,6],[188,2,188,6],[182,2,182,6],[70,2,70,6],[29,7,31,16],[256,2,256,6],[259,2,259,6],[258,7,260,16],[250,2,250,6],[253,2,253,6],[249,7,251,16],[252,7,254,16],[255,7,257,16],[1,8,2,10],[3,8,5,10],[10,7,12,16],[13,7,15,16],[16,7,18,16],[19,7,21,16],[231,7,231,16],[223,2,223,6],[226,2,226,6],[222,7,224,16],[225,7,227,16],[217,2,217,6],[220,2,220,6],[216,7,218,16],[219,7,221,16],[211,2,211,6],[246,2,246,6],[236,2,236,6],[239,2,239,6],[235,7,237,16],[229,2,229,6],[245,7,247,16],[242,2,242,6],[233,2,233,6],[228,7,230,16],[232,7,234,16],[244,7,244,16],[11,22,11,24],[8,22,8,25],[175,7,177,16],[178,7,180,16],[181,7,183,16],[129,7,131,16],[174,7,174,16],[116,7,118,16],[119,7,121,16],[132,7,134,16],[128,7,128,16],[95,7,97,16],[98,7,100,16],[101,7,103,16],[104,7,106,16],[122,7,124,16],[125,7,127,16],[45,7,47,16],[52,7,54,16],[79,7,81,16],[49,7,51,16],[65,7,65,16],[58,7,60,16],[33,7,35,16]]}
[{"$f":"VLOOKUP(Vocabularies!B7,Vocabularies!$B$1:$G$358,Vocabularies!$J$2,0)","v":"Supplier Self-Assessment"},{"$f":"VLOOKUP(\"Supplier:\",Vocabularies!#REF!,Vocabularies!$J$2,0)","v":{"$error":"#REF!"}},{"$f":"VLOOKUP(\"Supplier:\",Vocabularies!#REF!,Vocabularies!$J$2,0)","v":{"$error":"#REF!"}},null,null,null,null,null,{"$f":"Company_Profile!A4","v":"Status: Rev 05"}]
[null,null,null,null,null,null,null,null,{"$f":"VLOOKUP(Vocabularies!B3,Vocabularies!$B$1:$G$358,Vocabularies!$J$2,0)","v":"Date:"},null,null,null,null,null,null,null,null,null,null,null,null,null," "]
[{"$f":"VLOOKUP(Vocabularies!B5,Vocabularies!$B$1:$G$358,Vocabularies!$J$2,0)","v":"Supplier:"},null,{"$f":"IF(Company_Profile!B8=\"\",\"\",Company_Profile!B8)","v":""},null,null,null,null,null,null,null,null,null,null,null,null,null,null,null,null,null,null,null,0]
[null,null,null,null,null,null,null,null,{"$f":"Company_Profile!W4","v":"00:00:00"},null,null,null,null,null,null,null,null,null,null,null,null,null,1]
[{"$f":"VLOOKUP(Vocabularies!B107,Vocabularies!$B$1:$G$358,Vocabularies!$J$2,0)","v":"Section D Quality System Assessment"},null,null,null,null,null,null,null,null,null,null,null,null,null,null,null,null,null,null,null,null,null,2]
[null,null,null,null,null,null,null,null,null,null,null,null,null,null,null,null,null,null,null,null,null,null,"N/A"]
["1.",{"$f":"VLOOKUP(Vocabularies!B116,Vocabularies!$B$1:$G$358,Vocabularies!$J$2,0)","v":"Quality Management System"},null,null,null,null,null,{"$f":"VLOOKUP(Vocabularies!B111,Vocabularies!$B$1:$G$358,Vocabularies!$J$2,0)","v":"Comments (in case of answers „<2 or N/A“)"},null,null,null,null,null,null,null,null,null,{"$f":"VLOOKUP(Vocabularies!B4,Vocabularies!$B$1:$G$358,Vocabularies!$J$2,0)","v":"Assessment"}]
[]
[null,{"$f":"\"1.1\"","v":"1.1"},{"$f":"VLOOKUP(Vocabularies!B117,Vocabularies!$B$1:$G$358,Vocabularies!$J$2,0)","v":"Do you have a quality management system in accordance with IRIS?"},null,null,null,null,null,null,null,null,null,null,null,null,null,null,null," ",{"$f":"IF(S9=\" \",\"\",IF(S9=\"N/A\",\"\",IF(S9=2,\"Green Grün\",IF(S9=1,\"Yellow Gelb\",IF(S9=0,\"Red Rot\")))))","v":""},null,{"$f":"VLOOKUP(Vocabularies!B113,Vocabularies!$B$1:$G$358,Vocabularies!$J$2,0)","v":"0 = Requirement not satisfy"},{"$f":"VLOOKUP(Vocabularies!B114,Vocabularies!$B$1:$G$358,Vocabularies!$J$2,0)","v":"1 = Requirement partial satisfy "}]
[]
{"$rows_left_out":251}
{"sheet":"Questions_H_S","index":4,"n_rows":58,"n_cols":23,"rows_kept":58,"cut":false,"hidden":false,"merged":[[39,7,41,16],[40,2,40,6],[42,7,44,16],[43,2,43,6],[56,7,58,16],[57,2,57,6],[47,7,49,16],[48,2,48,6],[50,7,52,16],[51,2,51,6],[53,7,55,16],[54,2,54,6],[8,2,8,6],[11,2,11,6],[10,7,12,16],[38,7,38,16],[38,17,38,19],[6,17,6,19],[6,7,6,16],[25,7,25,16],[25,17,25,19],[7,7,9,16],[3,8,5,10],[0,0,0,2],[0,3,0,5],[0,8,0,10],[2,4,2,5],[1,8,2,10],[26,7,28,16],[13,7,15,16],[16,7,18,16],[19,7,21,16],[22,7,24,16],[27,2,27,6],[20,2,20,6],[23,2,23,6],[14,2,14,6],[17,2,17,6],[36,2,36,6],[35,7,36,16],[30,2,30,6],[33,2,33,6],[29,7,31,16],[32,7,34,16]]}
[{"$f":"VLOOKUP(Vocabularies!B7,Vocabularies!$B$1:$G$358,Vocabularies!$J$2,0)","v":"Supplier Self-Assessment"},{"$f":"VLOOKUP(\"Supplier:\",Vocabularies!#REF!,Vocabularies!$J$2,0)","v":{"$error":"#REF!"}},{"$f":"VLOOKUP(\"Supplier:\",Vocabularies!#REF!,Vocabularies!$J$2,0)","v":{"$error":"#REF!"}},null,null,null,null,null,{"$f":"Company_Profile!A4","v":"Status: Rev 05"}]
[null,null,null,null,null,null,null,null,{"$f":"VLOOKUP(Vocabularies!B3,Vocabularies!$B$1:$G$358,Vocabularies!$J$2,0)","v":"Date:"},null,null,null,null,null,null,null,null,null,null,null,null,null," "]
[{"$f":"VLOOKUP(Vocabularies!B5,Vocabularies!$B$1:$G$358,Vocabularies!$J$2,0)","v":"Supplier:"},null,{"$f":"IF(Company_Profile!B8=\"\",\"\",Company_Profile!B8)","v":""},null,null,null,null,null,null,null,null,null,null,null,null,null,null,null,null,null,null,null,0]
[null,null,null,null,null,null,null,null,{"$f":"Company_Profile!W4","v":"00:00:00"},null,null,null,null,null,null,null,null,null,null,null,null,null,1]
[{"$f":"VLOOKUP(Vocabularies!B212,Vocabularies!$B$1:$G$358,Vocabularies!$J$2,0)","v":"Section E Environmental and Safty management "},null,null,null,null,null,null,null,null,null,null,null,null,null,null,null,null,null,null,null,null,null,2]
[null,null,null,null,null,null,null,null,null,null,null,null,null,null,null,null,null,null,null,null,null,null,"N/A"]
["1.",{"$f":"VLOOKUP(Vocabularies!B213,Vocabularies!$B$1:$G$358,Vocabularies!$J$2,0)","v":"Information about environmental management in the company"},null,null,null,null,null,{"$f":"VLOOKUP(Vocabularies!B111,Vocabularies!$B$1:$G$358,Vocabularies!$J$2,0)","v":"Comments (in case of answers „<2 or N/A“)"},null,null,null,null,null,null,null,null,null,{"$f":"VLOOKUP(Vocabularies!B4,Vocabularies!$B$1:$G$358,Vocabularies!$J$2,0)","v":"Assessment"}]
[]
[null,{"$f":"\"1.1\"","v":"1.1"},{"$f":"VLOOKUP(Vocabularies!B214,Vocabularies!$B$1:$G$358,Vocabularies!$J$2,0)","v":"If no certification available, is there an environmental management system established compliant to a recognized standard, like EMAS (EU-regulation 1221/2009), ISO 14001 or BS 7750?"},null,null,null,null,null,null,null,null,null,null,null,null,null,null,null," ",{"$f":"IF(S9=\" \",\"\",IF(S9=\"N/A\",\"\",IF(S9=2,\"Green Grün\",IF(S9=1,\"Yellow Gelb\",IF(S9=0,\"Red Rot\")))))","v":""}]
[]
{"$rows_left_out":49}
{"sheet":"Questions_GCP","index":5,"n_rows":28,"n_cols":23,"rows_kept":28,"cut":false,"hidden":false,"merged":[[7,17,7,19],[7,7,7,16],[0,0,0,2],[0,3,0,5],[0,8,0,10],[1,8,2,10],[2,4,2,5],[3,8,5,10],[8,7,10,16],[9,2,9,6],[11,7,13,16],[12,2,12,6],[14,7,16,16],[15,2,15,6],[26,7,28,16],[27,2,27,6],[17,7,19,16],[18,2,18,6],[20,7,22,16],[21,2,21,6],[23,7,25,16],[24,2,24,6]]}
[{"$f":"VLOOKUP(Vocabularies!B7,Vocabularies!$B$1:$G$358,Vocabularies!$J$2,0)","v":"Supplier Self-Assessment"},{"$f":"VLOOKUP(\"Supplier:\",Vocabularies!#REF!,Vocabularies!$J$2,0)","v":{"$error":"#REF!"}},{"$f":"VLOOKUP(\"Supplier:\",Vocabularies!#REF!,Vocabularies!$J$2,0)","v":{"$error":"#REF!"}},null,null,null,null,null,{"$f":"Company_Profile!A4","v":"Status: Rev 05"}]
[null,null,null,null,null,null,null,null,{"$f":"VLOOKUP(Vocabularies!B3,Vocabularies!$B$1:$G$358,Vocabularies!$J$2,0)","v":"Date:"},null,null,null,null,null,null,null,null,null,null,null,null,null," "]
[{"$f":"VLOOKUP(Vocabularies!B5,Vocabularies!$B$1:$G$358,Vocabularies!$J$2,0)","v":"Supplier:"},null,{"$f":"IF(Company_Profile!B8=\"\",\"\",Company_Profile!B8)","v":""},null,null,null,null,null,null,null,null,null,null,null,null,null,null,null,null,null,null,null,0]
[null,null,null,null,null,null,null,null,{"$f":"Company_Profile!W4","v":"00:00:00"},null,null,null,null,null,null,null,null,null,null,null,null,null,1]
[{"$f":"VLOOKUP(Vocabularies!B232,Vocabularies!$B$1:$G$358,Vocabularies!$J$2,0)","v":"Section F Global Compact Principle"},null,null,null,null,null,null,null,null,null,null,null,null,null,null,null,null,null,null,null,null,null,2]
[null,null,null,null,null,null,null,null,null,null,null,null,null,null,null,null,null,null,null,null,null,null,"N/A"]
[{"$f":"VLOOKUP(Vocabularies!B233,Vocabularies!$B$1:$G$358,Vocabularies!$J$2,0)","v":"RESPONSIBLE BEHAVIOUR OF THE COMPANY"}]
["1.",{"$f":"VLOOKUP(Vocabularies!B234,Vocabularies!$B$1:$G$358,Vocabularies!$J$2,0)","v":"Information about Global Compact Principle"},null,null,null,null,null,{"$f":"VLOOKUP(Vocabularies!B111,Vocabularies!$B$1:$G$358,Vocabularies!$J$2,0)","v":"Comments (in case of answers „<2 or N/A“)"},null,null,null,null,null,null,null,null,null,{"$f":"VLOOKUP(Vocabularies!B4,Vocabularies!$B$1:$G$358,Vocabularies!$J$2,0)","v":"Assessment"}]
[]
[null,{"$f":"\"1.1\"","v":"1.1"},{"$f":"VLOOKUP(Vocabularies!B235,Vocabularies!$B$1:$G$358,Vocabularies!$J$2,0)","v":"Do you confirm complying with the UN Global Compact’s ten principles on human rights, labour, environment and anti-corruption?"},null,null,null,null,null,null,null,null,null,null,null,null,null,null,null," ",{"$f":"IF(S10=\" \",\"\",IF(S10=\"N/A\",\"\",IF(S10=2,\"Green Grün\",IF(S10=1,\"Yellow Gelb\",IF(S10=0,\"Red Rot\")))))","v":""}]
{"$rows_left_out":19}
{"sheet":"Vocabularies","index":6,"n_rows":326,"n_cols":10,"rows_kept":326,"cut":false,"hidden":true,"merged":[]}
["Zelle","English","Deutsch","Hungarian","Rusian","Italiano","Portugues"]
["Frage",null,null,null,null,null,null,null,"Sprache",1]
[2,"Date:","Datum:","Dátum:","Дата:",null,null,null,1,"English"]
[null,"Assessment","Bewertung","Értékelés","Оценка"]
[null,"Supplier:","Lieferant:","Beszállító","Поставщик:"]
[3,"Section A, Company Profil","Abschnitt A Allgemeine Angaben zum Unternehmen","A fejezet, cég profil","Раздел А, Профиль компании"]
[4,"Supplier Self-Assessment","Lieferantenselbstauskunft","Beszállítói önértékelés","Самооценка поставщика",null,null,null,2,"Deutsch"]
[5,"Company name (including legal form):","Lieferantenname (einschließlich Rechtsform):","Cég hivatalos neve:","Наименование компании (включая юридическое)",null,null,null,3,"Hungarian"]
[6,"Form completed by: ","Formular ausgefüllt von: ","Kitöltötte:","Заполнил:",null,null,null,4,"Rusian"]
[7,"Facility Address:","Anschrift des Standorts:","Cég bejegyzett címe:","Адрес производства:"]
{"$rows_left_out":317}
{"sheet":"Formeln","index":7,"n_rows":33,"n_cols":23,"rows_kept":33,"cut":false,"hidden":true,"merged":[[0,0,0,1],[15,2,15,3],[17,2,17,3],[18,2,18,3],[32,1,33,14],[19,2,19,3],[20,2,20,3],[22,2,22,3]]}
["Element",null,"Summe"]
[{"$f":"Questions_QMS!A7","v":"1."},{"$f":"VLOOKUP(Vocabularies!B107,Vocabularies!$B$1:$I$358,Vocabularies!$J$2,0)","v":"Section D Quality System Assessment"},{"$f":"SUM(Questions_QMS!S9:S260)","v":0}]
[{"$f":"Questions_QMS!A26","v":"2."},{"$f":"VLOOKUP(Vocabularies!B212,Vocabularies!$B$1:$I$358,Vocabularies!$J$2,0)","v":"Section E Environmental and Safty management "},{"$f":"SUM(Questions_H_S!S9:S58)","v":0}]
[{"$f":"Questions_QMS!A33","v":"3."},{"$f":"VLOOKUP(Vocabularies!B232,Vocabularies!$B$1:$I$358,Vocabularies!$J$2,0)","v":"Section F Global Compact Principle"},{"$f":"SUM(Questions_GCP!S10:S28)","v":0}]
[]
[]
[]
[]
[]
[]
{"$rows_left_out":23}